Reaction Details
TargetProto-oncogene tyrosine-protein kinase receptor Ret [V804L]
LigandBDBM311651
Substrate/Competitorn/a
Meas. Tech.Inhibitory Activity Against Resistance Mutation of RET (In Vitro)
IC50 0.300±n/a nM
Citation Miyazaki, IShimamura, TKato, MFujita, HIguchi, S Fused pyrimidine compound or salt thereof US Patent US10155768 Publication Date 12/18/2018
 
Proto-oncogene tyrosine-protein kinase receptor Ret [V804L]
Name:Proto-oncogene tyrosine-protein kinase receptor Ret [V804L]
Type:Enzyme Catalytic Domain
Mol. Mass.:124332.32
Organism:Homo sapiens (Human)
Description:P07949[V804L]
Residue:1114
BDBM311651
NameBDBM311651
Synonyms:Ex. Cpd. 103 US11046696, Compound 103
TypeSmall organic molecule
Emp. Form.C26H29N5O3
Mol. Mass.459.5402
SMILESCOCc1ccc(NC(=O)c2c(C#CCC3(O)CCC3)n(c3ncnc(N)c23)C2(C)CC2)cc1