Reaction Details
TargetProto-oncogene tyrosine-protein kinase receptor Ret [V804L]
LigandBDBM311663
Substrate/Competitorn/a
Meas. Tech.Inhibitory Activity Against Resistance Mutation of RET (In Vitro)
IC50 1.000±n/a nM
Citation Miyazaki, IShimamura, TKato, MFujita, HIguchi, S Fused pyrimidine compound or salt thereof US Patent US10155768 Publication Date 12/18/2018
 
Proto-oncogene tyrosine-protein kinase receptor Ret [V804L]
Name:Proto-oncogene tyrosine-protein kinase receptor Ret [V804L]
Type:Enzyme Catalytic Domain
Mol. Mass.:124332.32
Organism:Homo sapiens (Human)
Description:P07949[V804L]
Residue:1114
BDBM311663
NameBDBM311663
Synonyms:Ex. Cpd. 115 US11046696, Compound 115
TypeSmall organic molecule
Emp. Form.C21H25N5O2S
Mol. Mass.411.521
SMILESCCOc1c(C(=O)Nc2ccc(CSC)cc2)c2c(N)ncnc2n1C1(C)CC1