Reaction Details
TargetProto-oncogene tyrosine-protein kinase receptor Ret [V804M]
LigandBDBM311677
Substrate/Competitorn/a
Meas. Tech.Measurement of Inhibitory Activity Against RET (V804M)
IC50 3.80±n/a nM
Citation Miyazaki, IShimamura, TKato, MFujita, HIguchi, S Fused pyrimidine compound or salt thereof US Patent US10155768 Publication Date 12/18/2018
 
Proto-oncogene tyrosine-protein kinase receptor Ret [V804M]
Name:Proto-oncogene tyrosine-protein kinase receptor Ret [V804M]
Type:Enzyme Catalytic Domain
Mol. Mass.:124350.36
Organism:Homo sapiens (Human)
Description:P07949[V804M]
Residue:1114
BDBM311677
NameBDBM311677
Synonyms:Ex. Cpd. 129 | US11046696, Compound 129
TypeSmall organic molecule
Emp. Form.C24H23N7O2
Mol. Mass.441.4851
SMILESCOCc1ccc(NC(=O)c2c(C#Cc3ccn[nH]3)n(c3ncnc(N)c23)C2(C)CC2)cc1