Reaction Details
TargetVoltage-dependent calcium channel gamma-2 subunit
LigandBDBM311766
Substrate/Competitorn/a
Meas. Tech.Calcium Flux Assay
IC50 0.025±n/a nM
Citation Ameriks, MKLaforteza, BNLebold, TPRavula, SSavall, BMShireman, BT Fused azaheterocyclic compounds and their use as AMPA receptor modulators US Patent US10155769 Publication Date 12/18/2018
 
Voltage-dependent calcium channel gamma-2 subunit
Name:Voltage-dependent calcium channel gamma-2 subunit
Type:Enzyme Catalytic Domain
Mol. Mass.:35977.54
Organism:Homo sapiens (Human)
Description:n/a
Residue:323
BDBM311766
NameBDBM311766
Synonyms:2-Cyclobutyl-7-(4-fluorophenyl)-8-(7-methyl-1H-indazol-5-yl)-[1,2,4]triazolo[1,5-a]pyridine | US10155769, Example 4
TypeSmall organic molecule
Emp. Form.C24H20FN5
Mol. Mass.397.4475
SMILESCc1cc(cc2cn[nH]c12)-c1c(ccn2nc(nc12)C1CCC1)-c1ccc(F)cc1