Reaction Details
TargetVoltage-dependent calcium channel gamma-2 subunit
LigandBDBM311811
Substrate/Competitorn/a
Meas. Tech.Calcium Flux Assay
IC50 0.032±n/a nM
Citation Ameriks, MKLaforteza, BNLebold, TPRavula, SSavall, BMShireman, BT Fused azaheterocyclic compounds and their use as AMPA receptor modulators US Patent US10155769 Publication Date 12/18/2018
 
Voltage-dependent calcium channel gamma-2 subunit
Name:Voltage-dependent calcium channel gamma-2 subunit
Type:Enzyme Catalytic Domain
Mol. Mass.:35977.54
Organism:Homo sapiens (Human)
Description:n/a
Residue:323
BDBM311811
NameBDBM311811
Synonyms:7-Isopropyl-8-(7-methyl-1H-indazol-5-yl)-2-(trifluoromethyl)-[1,2,4]triazolo[1,5-a]pyridine | US10155769, Example 49
TypeSmall organic molecule
Emp. Form.C18H16F3N5
Mol. Mass.359.3483
SMILESCC(C)c1ccn2nc(nc2c1-c1cc(C)c2[nH]ncc2c1)C(F)(F)F