Reaction Details
TargetSomatostatin receptor type 4
LigandBDBM50081058
Substrate/Competitorn/a
Meas. Tech.AMP Assay with Human Somatostatin 4 Receptor
EC50 0.400±n/a nM
Citation Giovannini, RCui, YDoods, HFerrara, MJust, SKuelzer, RLingard, IMazzaferro, RRudolf, K Somatostatin receptor subtype 4 (SSTR4) agonists US Patent US10166214 Publication Date 1/1/2019
 
Somatostatin receptor type 4
Name:Somatostatin receptor type 4
Type:Enzyme
Mol. Mass.:42015.38
Organism:Homo sapiens (Human)
Description:P31391
Residue:388
BDBM50081058
NameBDBM50081058
Synonyms:CHEMBL3421842 US10675268, Example 22 | US9789082, Example 22
TypeSmall organic molecule
Emp. Form.C19H23N3O
Mol. Mass.309.4054
SMILES[H][C@@]12CNC[C@]1([H])[C@H]2C(=O)NC(C)(C)c1nc(C)cc2ccccc12