Reaction Details
TargetSomatostatin receptor type 4
LigandBDBM311967
Substrate/Competitorn/a
Meas. Tech.AMP Assay with Human Somatostatin 4 Receptor
EC50 0.300±n/a nM
Citation Giovannini, RCui, YDoods, HFerrara, MJust, SKuelzer, RLingard, IMazzaferro, RRudolf, K Somatostatin receptor subtype 4 (SSTR4) agonists US Patent US10166214 Publication Date 1/1/2019
 
Somatostatin receptor type 4
Name:Somatostatin receptor type 4
Type:Enzyme
Mol. Mass.:42015.38
Organism:Homo sapiens (Human)
Description:P31391
Residue:388
BDBM311967
NameBDBM311967
Synonyms:US10166214, Example 103 | US10675268, Example 103
TypeSmall organic molecule
Emp. Form.C16H18ClN3O2
Mol. Mass.319.786
SMILESCC(C)(NC(=O)[C@@H]1[C@H]2CNC[C@@H]12)c1noc2c(Cl)cccc12