Reaction Details
TargetSomatostatin receptor type 4
LigandBDBM311970
Substrate/Competitorn/a
Meas. Tech.AMP Assay with Human Somatostatin 4 Receptor
EC50 0.100±n/a nM
Citation Giovannini, RCui, YDoods, HFerrara, MJust, SKuelzer, RLingard, IMazzaferro, RRudolf, K Somatostatin receptor subtype 4 (SSTR4) agonists US Patent US10166214 Publication Date 1/1/2019
 
Somatostatin receptor type 4
Name:Somatostatin receptor type 4
Type:Enzyme
Mol. Mass.:42015.38
Organism:Homo sapiens (Human)
Description:P31391
Residue:388
BDBM311970
NameBDBM311970
Synonyms:US10166214, Example 106 | US10675268, Example 106
TypeSmall organic molecule
Emp. Form.C17H21ClN4O
Mol. Mass.332.828
SMILESCn1nc(c2cccc(Cl)c12)C(C)(C)NC(=O)[C@@H]1[C@H]2CNC[C@@H]12