Reaction Details
TargetSomatostatin receptor type 4
LigandBDBM311888
Substrate/Competitorn/a
Meas. Tech.Radiogland Binding Assays
Ki 2.90±n/a nM
Citation Giovannini, RCui, YDoods, HFerrara, MJust, SKuelzer, RLingard, IMazzaferro, RRudolf, K Somatostatin receptor subtype 4 (SSTR4) agonists US Patent US10166214 Publication Date 1/1/2019
 
Somatostatin receptor type 4
Name:Somatostatin receptor type 4
Type:Enzyme
Mol. Mass.:42015.38
Organism:Homo sapiens (Human)
Description:P31391
Residue:388
BDBM311888
NameBDBM311888
Synonyms:US10166214, Example 24 US9789082, Example 24
TypeSmall organic molecule
Emp. Form.C18H21N3O
Mol. Mass.295.3788
SMILESCC(C)(NC(=O)[C@@H]1[C@H]2CNC[C@@H]12)c1nccc2ccccc12