Reaction Details
TargetSomatostatin receptor type 4
LigandBDBM50081060
Substrate/Competitorn/a
Meas. Tech.Radiogland Binding Assays
Ki 46.2±n/a nM
Citation Giovannini, RCui, YDoods, HFerrara, MJust, SKuelzer, RLingard, IMazzaferro, RRudolf, K Somatostatin receptor subtype 4 (SSTR4) agonists US Patent US10166214 Publication Date 1/1/2019
 
Somatostatin receptor type 4
Name:Somatostatin receptor type 4
Type:Enzyme
Mol. Mass.:42015.38
Organism:Homo sapiens (Human)
Description:P31391
Residue:388
BDBM50081060
NameBDBM50081060
Synonyms:CHEMBL3421844 US10675268, Example 101 | US9789082, Example 101
TypeSmall organic molecule
Emp. Form.C16H18FN3O2
Mol. Mass.303.3314
SMILES[H][C@@]12CNC[C@]1([H])[C@H]2C(=O)NC(C)(C)c1noc2c(F)cccc12