Reaction Details
TargetCalcitonin gene-related peptide 1
LigandBDBM311965
Substrate/Competitorn/a
Meas. Tech.Radioligand Binding Assay
Ki 0.158±n/a nM
Citation Christopher, JACongreve, MSBucknell, SJDeflorian, FPickworth, MMason, JS CGRP receptor antagonists US Patent US10166226 Publication Date 1/1/2019
 
Calcitonin gene-related peptide 1
Name:Calcitonin gene-related peptide 1
Type:Enzyme
Mol. Mass.:13902.80
Organism:Homo sapiens (Human)
Description:P06881
Residue:128
BDBM311965
NameBDBM311965
Synonyms:N-{(2R)-3-(7-methyl-1H-indazol-5-yl)-1-oxo-1-[4-(1-propyl-1H-imidazol-2-yl)-1,4'-bipiperidin-1'-yl]propan-2-yl}-4-(2-oxo-1,2-dihydroquinolin-3-yl)piperidine-1-carboxamide | US10166226, Example 3
TypeSmall organic molecule
Emp. Form.C42H53N9O3
Mol. Mass.731.9287
SMILESCCCn1ccnc1C1CCN(CC1)C1CCN(CC1)C(=O)[C@@H](Cc1cc(C)c2[nH]ncc2c1)NC(=O)N1CCC(CC1)c1cc2ccccc2[nH]c1=O