Reaction Details
TargetCalcitonin gene-related peptide 1
LigandBDBM312049
Substrate/Competitorn/a
Meas. Tech.Radioligand Binding Assay
Ki 0.126±n/a nM
Citation Christopher, JACongreve, MSBucknell, SJDeflorian, FPickworth, MMason, JS CGRP receptor antagonists US Patent US10166226 Publication Date 1/1/2019
 
Calcitonin gene-related peptide 1
Name:Calcitonin gene-related peptide 1
Type:Enzyme
Mol. Mass.:13902.80
Organism:Homo sapiens (Human)
Description:P06881
Residue:128
BDBM312049
NameBDBM312049
Synonyms:4-(7-fluoro-2-oxo-1,2-dihydroquinolin-3-yl)-N-{(2R)-3-(7-methyl-1H-indazol-5-yl)-1-[4-(4-methyl-4H-1,2,4-triazol-3-yl)-1,4'-bipiperidin-1'-yl]-1-oxopropan-2-yl}piperidine-1-carboxamide | US10166226, Example 5
TypeSmall organic molecule
Emp. Form.C39H47FN10O3
Mol. Mass.722.8541
SMILESCc1cc(C[C@@H](NC(=O)N2CCC(CC2)c2cc3ccc(F)cc3[nH]c2=O)C(=O)N2CCC(CC2)N2CCC(CC2)c2nncn2C)cc2cn[nH]c12