Reaction Details
TargetNeprilysin
LigandBDBM155343
Substrate/Competitorn/a
Meas. Tech.Fluorescence Lifetime-Based Assay
IC50 0.030±n/a nM
Citation Coppola, GMIwaki, YKarki, RKawanami, TKsander, GMMogi, MSun, R Substituted aminobutyric derivatives as neprilysin inhibitors US Patent US9603819 Publication Date 3/28/2017
 
Neprilysin
Name:Neprilysin
Type:Enzyme
Mol. Mass.:85505.38
Organism:Homo sapiens (Human)
Description:P08473
Residue:750
BDBM155343
NameBDBM155343
Synonyms:US9006249, Example 49-2 | US9603819, Example 49-2
TypeSmall organic molecule
Emp. Form.C23H22ClN3O5
Mol. Mass.455.891
SMILESC[C@H](C[C@@H](Cc1ccc(cc1)-c1cccc(Cl)c1)NC(=O)c1cc(n[nH]1)C(O)=O)C(O)=O