Reaction Details
TargetMembrane primary amine oxidase
LigandBDBM309461
Substrate/Competitorn/a
Meas. Tech.Inhibitory Assay
IC50 13.0±n/a nM
Citation Matsukawa, TMasuzaki, KKawasaki, AAkasaka, AKawai, Y Benzene or thiophene derivative and use thereof as VAP-1 inhibitor US Patent US9603833 Publication Date 3/28/2017
 
Membrane primary amine oxidase
Name:Membrane primary amine oxidase
Type:Protein
Mol. Mass.:84620.86
Organism:Homo sapiens (Human)
Description:Q16853
Residue:763
BDBM309461
NameBDBM309461
Synonyms:US9603833, Example 30
TypeSmall organic molecule
Emp. Form.C20H27N3O
Mol. Mass.325.4479
SMILESCCN(CC)c1ccc(CCc2ccc(CC(=O)NN)cc2)cc1