Reaction Details
TargetMembrane primary amine oxidase
LigandBDBM309480
Substrate/Competitorn/a
Meas. Tech.Inhibitory Assay
IC50 6.30±n/a nM
Citation Matsukawa, TMasuzaki, KKawasaki, AAkasaka, AKawai, Y Benzene or thiophene derivative and use thereof as VAP-1 inhibitor US Patent US9603833 Publication Date 3/28/2017
 
Membrane primary amine oxidase
Name:Membrane primary amine oxidase
Type:Protein
Mol. Mass.:84620.86
Organism:Homo sapiens (Human)
Description:Q16853
Residue:763
BDBM309480
NameBDBM309480
Synonyms:US9603833, Example 95
TypeSmall organic molecule
Emp. Form.C17H23N5OS
Mol. Mass.345.462
SMILESNNC(=O)Cc1ccc(CCc2csc(n2)N2CCNCC2)cc1