Reaction Details
TargetBromodomain-containing protein 3 [326-398]
LigandBDBM50092323
Substrate/Competitorn/a
Meas. Tech.FP Competitive Binding Assay (No.350)
Temperature298.15±n/a K
Ki 26±1.80 nM
Commentsextracted
Citation Wang, SRan, XZhao, YYang, CLiu, LBai, LMcEachern, DStuckey, JMeagher, JLSun, DLi, XZhou, BKaratas, HLuo, RChinnaiyan, AAsangani, IA BET bromodomain inhibitors and therapeutic methods using the same US Patent US9675697 Publication Date 6/13/2017
 
Bromodomain-containing protein 3 [326-398]
Name:Bromodomain-containing protein 3 [326-398]
Type:n/a
Mol. Mass.:8553.07
Organism:Homo sapiens (Human)
Description:BD2 (326-398 aa) of Q15059
Residue:73
BDBM50092323
NameBDBM50092323
Synonyms:CHEMBL3581656 | US9675697, Cpd. No. 21
TypeSmall organic molecule
Emp. Form.C22H21N5O2
Mol. Mass.387.4344
SMILESCOc1cc2c(cc1-c1c(C)noc1C)[nH]c1ccnc(-c3c(C)n[nH]c3C)c21