Reaction Details
TargetBromodomain-containing protein 3 [326-398]
LigandBDBM179485
Substrate/Competitorn/a
Meas. Tech.FP Competitive Binding Assay (No.350)
Temperature298.15±n/a K
Ki 4.70±n/a nM
Commentsextracted
Citation Wang, SRan, XZhao, YYang, CLiu, LBai, LMcEachern, DStuckey, JMeagher, JLSun, DLi, XZhou, BKaratas, HLuo, RChinnaiyan, AAsangani, IA BET bromodomain inhibitors and therapeutic methods using the same US Patent US9675697 Publication Date 6/13/2017
 
Bromodomain-containing protein 3 [326-398]
Name:Bromodomain-containing protein 3 [326-398]
Type:n/a
Mol. Mass.:8553.07
Organism:Homo sapiens (Human)
Description:BD2 (326-398 aa) of Q15059
Residue:73
BDBM179485
NameBDBM179485
Synonyms:US9675697, Cpd. No. 183
TypeSmall organic molecule
Emp. Form.C26H26N4O3
Mol. Mass.442.5096
SMILESCOc1cc2c(cc1-c1c(C)noc1C)[nH]c1nc(C)nc(-c3cccc(c3)C(C)(C)O)c21