Reaction Details
TargetBromodomain-containing protein 2 [91-163]
LigandBDBM179639
Substrate/Competitorn/a
Meas. Tech.FP Competitive Binding Assay (No.350)
Temperature298.15±n/a K
Ki 3.20±n/a nM
Commentsextracted
Citation Wang, SRan, XZhao, YYang, CLiu, LBai, LMcEachern, DStuckey, JMeagher, JLSun, DLi, XZhou, BKaratas, HLuo, RChinnaiyan, AAsangani, IA BET bromodomain inhibitors and therapeutic methods using the same US Patent US9675697 Publication Date 6/13/2017
 
Bromodomain-containing protein 2 [91-163]
Name:Bromodomain-containing protein 2 [91-163]
Type:n/a
Mol. Mass.:8836.08
Organism:Homo sapiens (Human)
Description:BD1 (91-163 aa) of P25440
Residue:73
BDBM179639
NameBDBM179639
Synonyms:US9675697, Cpd. No. 322
TypeSmall organic molecule
Emp. Form.C36H42N6O4
Mol. Mass.622.7565
SMILESCOc1cc2c(cc1-c1c(C)noc1C)[nH]c1nc(C)nc(-c3cc(cc(c3)C(C)(C)C)C(=O)NC3CCN(CC3)C3COC3)c21