Reaction Details
TargetBromodomain-containing protein 3 [51-123]
LigandBDBM179633
Substrate/Competitorn/a
Meas. Tech.FP Competitive Binding Assay (No.350)
Temperature298.15±n/a K
Ki 7.50±n/a nM
Commentsextracted
Citation Wang, SRan, XZhao, YYang, CLiu, LBai, LMcEachern, DStuckey, JMeagher, JLSun, DLi, XZhou, BKaratas, HLuo, RChinnaiyan, AAsangani, IA BET bromodomain inhibitors and therapeutic methods using the same US Patent US9675697 Publication Date 6/13/2017
 
Bromodomain-containing protein 3 [51-123]
Name:Bromodomain-containing protein 3 [51-123]
Type:n/a
Mol. Mass.:8887.10
Organism:Homo sapiens (Human)
Description:BD1 (51-123 aa) of Q15059
Residue:73
BDBM179633
NameBDBM179633
Synonyms:US9675697, Cpd. No. 316
TypeSmall organic molecule
Emp. Form.C33H33N7O3
Mol. Mass.575.6602
SMILESCOc1cc2c(cc1-c1c(C)noc1C)[nH]c1nc(C)nc(-c3ccc(NC(=O)N4CCN(C)CC4)c4ccccc34)c21