Reaction Details
TargetSigma intracellular receptor 2
LigandBDBM50374602
Substrate/Competitorn/a
Meas. Tech.Receptor Assay
Ki 1.49±0.18 nM
Citation McCurdy, CRMesangeau, CChin, FTJames, MLShen, BGambhir, S Highly selective sigma receptor radioligands US Patent US9604926 Publication Date 3/28/2017
 
Sigma intracellular receptor 2
Name:Sigma intracellular receptor 2
Type:n/a
Mol. Mass.:20818.69
Organism:Mus musculus (Mouse)
Description:Q8VD00
Residue:176
BDBM50374602
NameBDBM50374602
Synonyms:CHEMBL272608 US9724435, Compound SN-102
TypeSmall organic molecule
Emp. Form.C23H35N3OS
Mol. Mass.401.609
SMILESO=c1sc2ccccc2n1CCCCCCN1CCN(CC1)C1CCCCC1