Reaction Details
TargetSigma intracellular receptor 2
LigandBDBM312198
Substrate/Competitorn/a
Meas. Tech.Receptor Assay
Ki 0.055±0.0063 nM
Citation McCurdy, CRMesangeau, CChin, FTJames, MLShen, BGambhir, S Highly selective sigma receptor radioligands US Patent US9604926 Publication Date 3/28/2017
 
Sigma intracellular receptor 2
Name:Sigma intracellular receptor 2
Type:n/a
Mol. Mass.:20818.69
Organism:Mus musculus (Mouse)
Description:Q8VD00
Residue:176
BDBM312198
NameBDBM312198
Synonyms:US9604926, Compound CM-365 | US9724435, Compound CM-365
TypeSmall organic molecule
Emp. Form.C21H30BrN3O2
Mol. Mass.436.386
SMILESBrc1ccc2oc(=O)n(CCCCN3CCN(CC3)C3CCCCC3)c2c1