Reaction Details
TargetSigma intracellular receptor 2
LigandBDBM312203
Substrate/Competitorn/a
Meas. Tech.Receptor Assay
Ki 0.660±0.08 nM
Citation McCurdy, CRMesangeau, CChin, FTJames, MLShen, BGambhir, S Highly selective sigma receptor radioligands US Patent US9604926 Publication Date 3/28/2017
 
Sigma intracellular receptor 2
Name:Sigma intracellular receptor 2
Type:n/a
Mol. Mass.:20818.69
Organism:Mus musculus (Mouse)
Description:Q8VD00
Residue:176
BDBM312203
NameBDBM312203
Synonyms:US9604926, Compound CM-401 | US9724435, Compound CM-401
TypeSmall organic molecule
Emp. Form.C24H25FN2O3
Mol. Mass.408.4653
SMILESCC(=O)c1ccc2n(CCCCN3CCC(=CC3)c3ccc(F)cc3)c(=O)oc2c1