Reaction Details
TargetSigma intracellular receptor 2
LigandBDBM312234
Substrate/Competitorn/a
Meas. Tech.Receptor Assay
Ki 0.220±0.09 nM
Citation McCurdy, CRMesangeau, CChin, FTJames, MLShen, BGambhir, S Highly selective sigma receptor radioligands US Patent US9604926 Publication Date 3/28/2017
 
Sigma intracellular receptor 2
Name:Sigma intracellular receptor 2
Type:n/a
Mol. Mass.:20818.69
Organism:Mus musculus (Mouse)
Description:Q8VD00
Residue:176
BDBM312234
NameBDBM312234
Synonyms:US9604926, Compound AZ-68 | US9724435, Compound AZ-68
TypeSmall organic molecule
Emp. Form.C21H30FN3OS
Mol. Mass.391.546
SMILESFc1ccc2n(CCCCN3CCN(CC3)C3CCCCC3)c(=O)sc2c1