Reaction Details
TargetAmine oxidase [flavin-containing] A
LigandBDBM179461
Substrate/Competitorn/a
Meas. Tech.Monoamine Oxidase Assays
pH7.5±n/a
Ki>1000±n/a nM
Commentsextracted
Citation Fyfe, MCOrtega Muñoz, ACastro-Palomino Laria, JMartinell Pedemonte, MEstiarte-Martinez, MValls Vidal, N Cyclopropylamine derivatives useful as LSD1 inhibitors US Patent US9676701 Publication Date 6/13/2017
 
Amine oxidase [flavin-containing] A
Name:Amine oxidase [flavin-containing] A
Type:Protein
Mol. Mass.:59689.53
Organism:Homo sapiens (Human)
Description:P21397
Residue:527
BDBM179461
NameBDBM179461
Synonyms:US9676701, 9 (trans)-2-(6-(4-(trifluoromethyl)phenyl)pyridin-3-yl)cyclopropanamine hydrochloride
TypeSmall organic molecule
Emp. Form.C15H13F3N2
Mol. Mass.278.2723
SMILESN[C@H]1C[C@@H]1c1ccc(nc1)-c1ccc(cc1)C(F)(F)F