Reaction Details
TargetAmine oxidase [flavin-containing] A
LigandBDBM179646
Substrate/Competitorn/a
Meas. Tech.Monoamine Oxidase Assays
pH7.5±n/a
Ki>1000±n/a nM
Commentsextracted
Citation Fyfe, MCOrtega Muñoz, ACastro-Palomino Laria, JMartinell Pedemonte, MEstiarte-Martinez, MValls Vidal, N Cyclopropylamine derivatives useful as LSD1 inhibitors US Patent US9676701 Publication Date 6/13/2017
 
Amine oxidase [flavin-containing] A
Name:Amine oxidase [flavin-containing] A
Type:Protein
Mol. Mass.:59689.53
Organism:Homo sapiens (Human)
Description:P21397
Residue:527
BDBM179646
NameBDBM179646
Synonyms:US9676701, 17 3-(5-((trans)-2-aminocyclopropyl)pyridin-2-yl)phenol dihydrochloride | US9676701, 21 3-(5-((trans)-2-aminocyclopropyl)pyridin-2-yl)phenol
TypeSmall organic molecule
Emp. Form.C14H14N2O
Mol. Mass.226.2738
SMILESN[C@H]1C[C@@H]1c1ccc(nc1)-c1cccc(O)c1