Reaction Details
TargetAmine oxidase [flavin-containing] A
LigandBDBM179654
Substrate/Competitorn/a
Meas. Tech.Monoamine Oxidase Assays
pH7.5±n/a
Ki>1000±n/a nM
Commentsextracted
Citation Fyfe, MCOrtega Muñoz, ACastro-Palomino Laria, JMartinell Pedemonte, MEstiarte-Martinez, MValls Vidal, N Cyclopropylamine derivatives useful as LSD1 inhibitors US Patent US9676701 Publication Date 6/13/2017
 
Amine oxidase [flavin-containing] A
Name:Amine oxidase [flavin-containing] A
Type:Protein
Mol. Mass.:59689.53
Organism:Homo sapiens (Human)
Description:P21397
Residue:527
BDBM179654
NameBDBM179654
Synonyms:US9676701, 25 3-(5-((trans)-2-aminocyclopropyl)pyridin-2-yl)-4-fluorophenol hydrochloride
TypeSmall organic molecule
Emp. Form.C14H13FN2O
Mol. Mass.244.2642
SMILESN[C@H]1C[C@@H]1c1ccc(nc1)-c1cc(O)ccc1F