Reaction Details
TargetLysine-specific histone demethylase 1A
LigandBDBM179654
Substrate/Competitorn/a
Meas. Tech.LSD1 Assay
pH7.4±n/a
Temperature298.15±n/a K
Ki 50±n/a nM
Commentsextracted
Citation Fyfe, MCOrtega Muñoz, ACastro-Palomino Laria, JMartinell Pedemonte, MEstiarte-Martinez, MValls Vidal, N Cyclopropylamine derivatives useful as LSD1 inhibitors US Patent US9676701 Publication Date 6/13/2017
 
Lysine-specific histone demethylase 1A
Name:Lysine-specific histone demethylase 1A
Type:Enzyme
Mol. Mass.:92901.01
Organism:Homo sapiens (Human)
Description:O60341
Residue:852
BDBM179654
NameBDBM179654
Synonyms:US9676701, 25 3-(5-((trans)-2-aminocyclopropyl)pyridin-2-yl)-4-fluorophenol hydrochloride
TypeSmall organic molecule
Emp. Form.C14H13FN2O
Mol. Mass.244.2642
SMILESN[C@H]1C[C@@H]1c1ccc(nc1)-c1cc(O)ccc1F