Reaction Details
TargetLysine-specific histone demethylase 1A
LigandBDBM179835
Substrate/Competitorn/a
Meas. Tech.LSD1 Assay
pH7.4±n/a
Temperature298.15±n/a K
Ki 50±n/a nM
Commentsextracted
Citation Fyfe, MCOrtega Muñoz, ACastro-Palomino Laria, JMartinell Pedemonte, MEstiarte-Martinez, MValls Vidal, N Cyclopropylamine derivatives useful as LSD1 inhibitors US Patent US9676701 Publication Date 6/13/2017
 
Lysine-specific histone demethylase 1A
Name:Lysine-specific histone demethylase 1A
Type:Enzyme
Mol. Mass.:92901.01
Organism:Homo sapiens (Human)
Description:O60341
Residue:852
BDBM179835
NameBDBM179835
Synonyms:US9676701, 70 N-(4′-((trans)-2-aminocyclopropyl)biphenyl-3-yl)methanesulfonamide hydrochloride
TypeSmall organic molecule
Emp. Form.C16H18N2O2S
Mol. Mass.302.391
SMILESCS(=O)(=O)Nc1cccc(c1)-c1ccc(cc1)[C@H]1C[C@@H]1N