Reaction Details
TargetAmine oxidase [flavin-containing] A
LigandBDBM179856
Substrate/Competitorn/a
Meas. Tech.Monoamine Oxidase Assays
pH7.5±n/a
Ki>1000±n/a nM
Commentsextracted
Citation Fyfe, MCOrtega Muñoz, ACastro-Palomino Laria, JMartinell Pedemonte, MEstiarte-Martinez, MValls Vidal, N Cyclopropylamine derivatives useful as LSD1 inhibitors US Patent US9676701 Publication Date 6/13/2017
 
Amine oxidase [flavin-containing] A
Name:Amine oxidase [flavin-containing] A
Type:Protein
Mol. Mass.:59689.53
Organism:Homo sapiens (Human)
Description:P21397
Residue:527
BDBM179856
NameBDBM179856
Synonyms:US9676701, 90 N-(3-(5-((trans)-2-aminocyclopropyl)pyridin-2-yl)-4-hydroxyphenyl)methanesulfonamide hydrochloride
TypeSmall organic molecule
Emp. Form.C15H17N3O3S
Mol. Mass.319.379
SMILESCS(=O)(=O)Nc1ccc(O)c(c1)-c1ccc(cn1)[C@H]1C[C@@H]1N