Reaction Details
TargetAmine oxidase [flavin-containing] A
LigandBDBM179976
Substrate/Competitorn/a
Meas. Tech.Monoamine Oxidase Assays
pH7.5±n/a
Ki 50±n/a nM
Commentsextracted
Citation Fyfe, MCOrtega Muñoz, ACastro-Palomino Laria, JMartinell Pedemonte, MEstiarte-Martinez, MValls Vidal, N Cyclopropylamine derivatives useful as LSD1 inhibitors US Patent US9676701 Publication Date 6/13/2017
 
Amine oxidase [flavin-containing] A
Name:Amine oxidase [flavin-containing] A
Type:Protein
Mol. Mass.:59689.53
Organism:Homo sapiens (Human)
Description:P21397
Residue:527
BDBM179976
NameBDBM179976
Synonyms:US9676701, 116 3-(5-((trans)-2-aminocyclopropyl)thiazol-2-yl)phenol hydrochloride
TypeSmall organic molecule
Emp. Form.C12H12N2OS
Mol. Mass.232.301
SMILESN[C@H]1C[C@@H]1c1cnc(s1)-c1cccc(O)c1