Reaction Details
TargetSteroid hormone receptor ERR2
LigandBDBM312133
Substrate/Competitorn/a
Meas. Tech.Competitive Radioligand-Binding Assay
Ki 3.00±n/a nM
Citation Narayanan, RDalton, JTLevin, E Nuclear receptor binding agents US Patent US9604931 Publication Date 3/28/2017
 
Steroid hormone receptor ERR2
Name:Steroid hormone receptor ERR2
Type:PROTEIN
Mol. Mass.:48061.77
Organism:Homo sapiens (Human)
Description:ChEMBL_11254
Residue:433
BDBM312133
NameBDBM312133
Synonyms:US9604931, 12z
TypeSmall organic molecule
Emp. Form.C15H9BrFNO4
Mol. Mass.366.139
SMILESOc1cc(O)c2c(c1)c(Br)cn(-c1ccc(O)c(F)c1)c2=O