Reaction Details
TargetSteroid hormone receptor ERR2
LigandBDBM312149
Substrate/Competitorn/a
Meas. Tech.Competitive Radioligand-Binding Assay
Ki 3.03±n/a nM
Citation Narayanan, RDalton, JTLevin, E Nuclear receptor binding agents US Patent US9604931 Publication Date 3/28/2017
 
Steroid hormone receptor ERR2
Name:Steroid hormone receptor ERR2
Type:PROTEIN
Mol. Mass.:48061.77
Organism:Homo sapiens (Human)
Description:ChEMBL_11254
Residue:433
BDBM312149
NameBDBM312149
Synonyms:6,8-dihydroxy-2-(4-hydroxyphenyl)-4-(4-methoxyphenyl)isoquinolin-1(2H)-one US9604931, 15h | US9623021, Compound 15h
TypeSmall organic molecule
Emp. Form.C21H15NO4
Mol. Mass.345.3481
SMILESOc1ccc(cc1)-n1cc(-c2ccccc2)c2cc(O)cc(O)c2c1=O