Reaction Details
TargetAromatase
LigandBDBM9460
Substrate/CompetitorBDBM8592
Meas. Tech.CYP19 Assay
pH7±n/a
Temperature310.15±n/a K
Ki 1410±10 nM
IC50 2800±n/a nM
Km90±10 nM
Citation Su, BHackett, JCDiaz-Cruz, ESKim, YWBrueggemeier, RW Lead optimization of 7-benzyloxy 2-(4'-pyridylmethyl)thio isoflavone aromatase inhibitors. Bioorg Med Chem13:6571-7 (2005) 
 
Aromatase
Name:Aromatase
Type:Enzyme
Mol. Mass.:57888.92
Organism:Homo sapiens (Human)
Description:P11511
Residue:503
BDBM9460
BDBM8592
NameBDBM9460
Synonyms:3-(4-aminophenyl)-3-ethyl-piperidine-2,6-dione Aminoglutethimide AG, 4 Cytadren Elipten | aminoglutethimide (AG)
TypeSmall organic molecule
Emp. Form.C13H16N2O2
Mol. Mass.232.2783
SMILESCCC1(CCC(=O)NC1=O)c1ccc(N)cc1