Reaction Details
TargetAromatase
LigandBDBM9942
Substrate/CompetitorBDBM8592
Meas. Tech.Aromatase Assay
pH7.5±n/a
Temperature310.15±n/a K
Ki 22±n/a nM
IC50 270±n/a nM
Citation Numazawa, MOshibe, MYamaguchi, STachibana, M Time-dependent inactivation of aromatase by 6-alkylandrosta-1,4-diene-3,17-diones. Effects of length and configuration of 6-alkyl group. J Med Chem39:1033-8 (1996) 
 
Aromatase
Name:Aromatase
Type:Enzyme
Mol. Mass.:57888.92
Organism:Homo sapiens (Human)
Description:P11511
Residue:503
BDBM9942
BDBM8592
NameBDBM9942
Synonyms:(8S)-2,15-dimethyl-8-propyltetracyclo[8.7.0.0^{2,7}.0^{11,15}]heptadeca-3,6-diene-5,14-dione | 6-Alkyl 1,4-Diene Steroid 3c
TypeSmall organic molecule
Emp. Form.C22H30O2
Mol. Mass.326.4724
SMILESCCC[C@H]1CC2C3CCC(=O)C3(C)CCC2C2(C)C=CC(=O)C=C12