Reaction Details
TargetAromatase
LigandBDBM9954
Substrate/CompetitorBDBM8592
Meas. Tech.Aromatase Assay
pH7.5±n/a
Temperature310.15±n/a K
Ki 43±n/a nM
IC50 530±n/a nM
Citation Numazawa, MOshibe, MYamaguchi, STachibana, M Time-dependent inactivation of aromatase by 6-alkylandrosta-1,4-diene-3,17-diones. Effects of length and configuration of 6-alkyl group. J Med Chem39:1033-8 (1996) 
 
Aromatase
Name:Aromatase
Type:Enzyme
Mol. Mass.:57888.92
Organism:Homo sapiens (Human)
Description:P11511
Residue:503
BDBM9954
BDBM8592
NameBDBM9954
Synonyms:1,4-Androsten-3,17-dione | 2,15-dimethyltetracyclo[8.7.0.0^{2,7}.0^{11,15}]heptadeca-3,6-diene-5,14-dione
TypeSmall organic molecule
Emp. Form.C19H24O2
Mol. Mass.284.3927
SMILESCC12CCC3C(CCC4=CC(=O)C=CC34C)C1CCC2=O