Reaction Details
TargetAromatase
LigandBDBM9982
Substrate/CompetitorBDBM8592
Meas. Tech.Aromatase Assay
Ki 45±n/a nM
IC50 360±n/a nM
Citation Numazawa, MKamiyama, TTachibana, MOshibe, M Synthesis and structure-activity relationships of 6-substituted androst-4-ene analogs as aromatase inhibitors. J Med Chem39:2245-52 (1996) 
 
Aromatase
Name:Aromatase
Type:Enzyme
Mol. Mass.:57888.92
Organism:Homo sapiens (Human)
Description:P11511
Residue:503
BDBM9982
BDBM8592
NameBDBM9982
Synonyms:(14S)-2,15-dimethyltetracyclo[8.7.0.0^{2,7}.0^{11,15}]heptadec-6-en-14-ol | 3-deoxy steroid 2
TypeSmall organic molecule
Emp. Form.C19H30O
Mol. Mass.274.4409
SMILESCC12CCC3C(CCC4=CCCCC34C)C1CC[C@@H]2O