Reaction Details
TargetAromatase
LigandBDBM9993
Substrate/CompetitorBDBM8592
Meas. Tech.Aromatase Assay
pH7.5±n/a
Temperature310.15±n/a K
Ki 250±n/a nM
IC50 1400±n/a nM
Km33±n/a nM
Citation Numazawa, MYamada, KNitta, SSasaki, CKidokoro, K Role of hydrophilic interaction in binding of hydroxylated 3-deoxy C(19) steroids to the active site of aromatase. J Med Chem44:4277-83 (2001) 
 
Aromatase
Name:Aromatase
Type:Enzyme
Mol. Mass.:57888.92
Organism:Homo sapiens (Human)
Description:P11511
Residue:503
BDBM9993
BDBM8592
NameBDBM9993
Synonyms:(2S,8S,15S)-8-hydroxy-2-(hydroxymethyl)-15-methyltetracyclo[8.7.0.0^{2,7}.0^{11,15}]heptadec-6-en-14-one Hydroxylated 3-Deoxy C19 Steroid 36
TypeSmall organic molecule
Emp. Form.C19H28O3
Mol. Mass.304.4238
SMILESC[C@]12CCC3C(C[C@H](O)C4=CCCC[C@]34CO)C1CCC2=O