Reaction Details
TargetProstaglandin E2 receptor EP2 subtype
LigandBDBM179999
Substrate/Competitorn/a
Meas. Tech.Binding Assay
pH6±n/a
Ki 0.94±n/a nM
Commentsextracted
Citation Shibakawa, NYoneda, KKatsube, TKanda, TIto, KYamamoto, KIwase, NUshiyama, S Substituted biaryl compound US Patent US9676720 Publication Date 6/13/2017
 
Prostaglandin E2 receptor EP2 subtype
Name:Prostaglandin E2 receptor EP2 subtype
Type:Enzyme
Mol. Mass.:39775.71
Organism:Homo sapiens (Human)
Description:P43116
Residue:358
BDBM179999
NameBDBM179999
Synonyms:US9676720, Example 12
TypeSmall organic molecule
Emp. Form.C27H27N5O5S
Mol. Mass.533.599
SMILESCCOc1cccc(n1)-c1ccc(CN(Cc2cccc(NCC(O)=O)n2)S(=O)(=O)c2ccccn2)cc1