Reaction Details
TargetProstaglandin E2 receptor EP2 subtype
LigandBDBM180003
Substrate/Competitorn/a
Meas. Tech.Binding Assay
pH6±n/a
Ki 0.99±n/a nM
Commentsextracted
Citation Shibakawa, NYoneda, KKatsube, TKanda, TIto, KYamamoto, KIwase, NUshiyama, S Substituted biaryl compound US Patent US9676720 Publication Date 6/13/2017
 
Prostaglandin E2 receptor EP2 subtype
Name:Prostaglandin E2 receptor EP2 subtype
Type:Enzyme
Mol. Mass.:39775.71
Organism:Homo sapiens (Human)
Description:P43116
Residue:358
BDBM180003
NameBDBM180003
Synonyms:US9676720, Example 18
TypeSmall organic molecule
Emp. Form.C28H25N3O4S2
Mol. Mass.531.646
SMILESCC#Cc1cccc(c1)-c1ccc(CN(Cc2cccc(NCC(O)=O)n2)S(=O)(=O)c2ccsc2)cc1