Reaction Details
TargetProstaglandin E2 receptor EP2 subtype
LigandBDBM180026
Substrate/Competitorn/a
Meas. Tech.Binding Assay
pH6±n/a
Ki 2.60±n/a nM
Commentsextracted
Citation Shibakawa, NYoneda, KKatsube, TKanda, TIto, KYamamoto, KIwase, NUshiyama, S Substituted biaryl compound US Patent US9676720 Publication Date 6/13/2017
 
Prostaglandin E2 receptor EP2 subtype
Name:Prostaglandin E2 receptor EP2 subtype
Type:Enzyme
Mol. Mass.:39775.71
Organism:Homo sapiens (Human)
Description:P43116
Residue:358
BDBM180026
NameBDBM180026
Synonyms:US9676720, Comparative example 13
TypeSmall organic molecule
Emp. Form.C28H28N4O5S
Mol. Mass.532.611
SMILESCCOc1ccccc1-c1ccc(CN(Cc2cccc(NCC(O)=O)n2)S(=O)(=O)c2ccccn2)cc1