Reaction Details
TargetAromatase
LigandBDBM10045
Substrate/CompetitorBDBM8592
Meas. Tech.Aromatase Assay
pH7.2±n/a
Temperature310.15±n/a K
IC50 12±n/a nM
Citation Lesuisse, DGourvest, JFBenslimane, OCanu, FDelaisi, CDoucet, BHartmann, CLefrancois, JMTric, BMansuy, DPhilibert, DTeutsch, G Structure-activity relationships of a new family of steroidal aromatase inhibitors. 1. Synthesis and evaluation of a series of analogs related to 19-[(methylthio)methyl]androstenedione (RU54115). J Med Chem39:757-72 (1996) 
 
Aromatase
Name:Aromatase
Type:Enzyme
Mol. Mass.:57888.92
Organism:Homo sapiens (Human)
Description:P11511
Residue:503
BDBM10045
BDBM8592
NameBDBM10045
Synonyms:(2R,15S)-15-methyl-2-[2-(methylsulfanyl)ethyl]tetracyclo[8.7.0.0^{2,7}.0^{11,15}]heptadeca-1(17),6-diene-5,14-dione | RU54115 Analog 7
TypeSmall organic molecule
Emp. Form.C21H28O2S
Mol. Mass.344.511
SMILESCSCC[C@]12CCC(=O)C=C1CCC1C3CCC(=O)[C@@]3(C)CC=C21