Reaction Details
TargetTyrosine-protein kinase JAK2
LigandBDBM232511
Substrate/Competitorn/a
Meas. Tech.JAK Enzyme Assay
Ki 0.130±n/a nM
Citation Zak, MERay, NCGoodacre, SCMendonca, RKellar, TCheng, YLi, WYuen, P 5-chloro-2-difluoromethoxyphenyl pyrazolopyrimidine compounds, compositions and methods of use thereof US Patent US9604984 Publication Date 3/28/2017
 
Tyrosine-protein kinase JAK2
Name:Tyrosine-protein kinase JAK2
Type:Protein
Mol. Mass.:130684.68
Organism:Homo sapiens (Human)
Description:O60674
Residue:1132
BDBM232511
NameBDBM232511
Synonyms:US9346815, 57 | US9604984, Example 57
TypeSmall organic molecule
Emp. Form.C29H30ClF2N9O3
Mol. Mass.626.057
SMILESNc1nn2cccnc2c1C(=O)Nc1cn(CC(=O)N2C[C@@H]3CN(CC4CC4)C[C@@H]3C2)nc1-c1cc(Cl)ccc1OC(F)F