Reaction Details
TargetTyrosine-protein kinase JAK2
LigandBDBM312669
Substrate/Competitorn/a
Meas. Tech.JAK Enzyme Assay
Ki 0.170±n/a nM
Citation Zak, MERay, NCGoodacre, SCMendonca, RKellar, TCheng, YLi, WYuen, P 5-chloro-2-difluoromethoxyphenyl pyrazolopyrimidine compounds, compositions and methods of use thereof US Patent US9604984 Publication Date 3/28/2017
 
Tyrosine-protein kinase JAK2
Name:Tyrosine-protein kinase JAK2
Type:Protein
Mol. Mass.:130684.68
Organism:Homo sapiens (Human)
Description:O60674
Residue:1132
BDBM312669
NameBDBM312669
Synonyms:N-[1-[1-(3- acetamidopropyl)-4- piperidyl]-3-[5-chloro-2- (difluoromethoxy)phenyl] pyrazol-4-yl]-2-amino- pyrazolo[1,5- a]pyrimidine-3- carboxamide | US9604984, Example 150
TypeSmall organic molecule
Emp. Form.C27H34ClF2N9O3
Mol. Mass.606.067
SMILESCC(=O)NCCCN1CCC(CC1)N\C=C(\NC(=O)C(\C(N)=N)=C1\NC=CC=N1)C(=N)c1cc(Cl)ccc1OC(F)F