Reaction Details
TargetTyrosine-protein kinase JAK1
LigandBDBM232629
Substrate/Competitorn/a
Meas. Tech.JAK Enzyme Assay
Ki 0.780±n/a nM
Citation Zak, MERay, NCGoodacre, SCMendonca, RKellar, TCheng, YLi, WYuen, P 5-chloro-2-difluoromethoxyphenyl pyrazolopyrimidine compounds, compositions and methods of use thereof US Patent US9604984 Publication Date 3/28/2017
 
Tyrosine-protein kinase JAK1
Name:Tyrosine-protein kinase JAK1
Type:Protein
Mol. Mass.:133293.73
Organism:Homo sapiens (Human)
Description:P23458
Residue:1154
BDBM232629
NameBDBM232629
Synonyms:US9346815, 175 | US9604984, Example 175
TypeSmall organic molecule
Emp. Form.C28H31ClF2N8O4
Mol. Mass.617.047
SMILESCCOC(=O)CCCN1CCC(CC1)n1cc(NC(=O)c2c(N)nn3cccnc23)c(n1)-c1cc(Cl)ccc1OC(F)F