Reaction Details
TargetTyrosine-protein kinase JAK1
LigandBDBM232736
Substrate/Competitorn/a
Meas. Tech.JAK Enzyme Assay
Ki 0.170±n/a nM
Citation Zak, MERay, NCGoodacre, SCMendonca, RKellar, TCheng, YLi, WYuen, P 5-chloro-2-difluoromethoxyphenyl pyrazolopyrimidine compounds, compositions and methods of use thereof US Patent US9604984 Publication Date 3/28/2017
 
Tyrosine-protein kinase JAK1
Name:Tyrosine-protein kinase JAK1
Type:Protein
Mol. Mass.:133293.73
Organism:Homo sapiens (Human)
Description:P23458
Residue:1154
BDBM232736
NameBDBM232736
Synonyms:US9346815, 282 | US9604984, Example 282
TypeSmall organic molecule
Emp. Form.C23H19ClF4N8O3
Mol. Mass.566.895
SMILESNc1nn2cccnc2c1C(=O)Nc1cn(CC(=O)N2CCC(F)(F)C2)nc1-c1cc(Cl)ccc1OC(F)F