Reaction Details
TargetTyrosine-protein kinase JAK2
LigandBDBM232754
Substrate/Competitorn/a
Meas. Tech.JAK Enzyme Assay
Ki 0.180±n/a nM
Citation Zak, MERay, NCGoodacre, SCMendonca, RKellar, TCheng, YLi, WYuen, P 5-chloro-2-difluoromethoxyphenyl pyrazolopyrimidine compounds, compositions and methods of use thereof US Patent US9604984 Publication Date 3/28/2017
 
Tyrosine-protein kinase JAK2
Name:Tyrosine-protein kinase JAK2
Type:Protein
Mol. Mass.:130684.68
Organism:Homo sapiens (Human)
Description:O60674
Residue:1132
BDBM232754
NameBDBM232754
Synonyms:US9346815, 300 | US9604984, Example 300
TypeSmall organic molecule
Emp. Form.C27H22Cl2F2N8O3
Mol. Mass.615.418
SMILESCCN(Cc1ccnc(Cl)c1)C(=O)Cn1cc(NC(=O)c2cnn3cccnc23)c(n1)-c1cc(Cl)ccc1OC(F)F