Reaction Details
TargetTyrosine-protein kinase JAK1
LigandBDBM232796
Substrate/Competitorn/a
Meas. Tech.JAK Enzyme Assay
Ki 0.190±n/a nM
Citation Zak, MERay, NCGoodacre, SCMendonca, RKellar, TCheng, YLi, WYuen, P 5-chloro-2-difluoromethoxyphenyl pyrazolopyrimidine compounds, compositions and methods of use thereof US Patent US9604984 Publication Date 3/28/2017
 
Tyrosine-protein kinase JAK1
Name:Tyrosine-protein kinase JAK1
Type:Protein
Mol. Mass.:133293.73
Organism:Homo sapiens (Human)
Description:P23458
Residue:1154
BDBM232796
NameBDBM232796
Synonyms:US9346815, 342 | US9604984, Example 342
TypeSmall organic molecule
Emp. Form.C25H22ClF2N7O5
Mol. Mass.573.936
SMILESOC(=O)C1CCN(CC1)C(=O)Cn1cc(NC(=O)c2cnn3cccnc23)c(n1)-c1cc(Cl)ccc1OC(F)F