Reaction Details
TargetNicotinamide phosphoribosyltransferase
LigandBDBM180918
Substrate/Competitorn/a
Meas. Tech.Biochemical Inhibition Assay
pH7.5±n/a
Temperature298.15±n/a K
IC50 1.00±n/a nM
Commentsextracted
Citation Bair, KWBuckmelter, AJHan, BLin, JReynolds, DJSmith, CCWang, ZZheng, X Compounds and compositions for the inhibition of NAMPT US Patent US9676721 Publication Date 6/13/2017
 
Nicotinamide phosphoribosyltransferase
Name:Nicotinamide phosphoribosyltransferase
Type:Enzyme
Mol. Mass.:55524.98
Organism:Homo sapiens (Human)
Description:P43490
Residue:491
BDBM180918
NameBDBM180918
Synonyms:US9676721, 36 2-cyano-1-({4-[(3-fluoro-4-methoxybenzene)sulfonyl]phenyl}methyl)-3-(pyridin-4-yl)guanidine
TypeSmall organic molecule
Emp. Form.C21H18FN5O3S
Mol. Mass.439.463
SMILESCOc1ccc(cc1F)S(=O)(=O)c1ccc(CNC(Nc2ccncc2)=NC#N)cc1