Reaction Details
TargetNicotinamide phosphoribosyltransferase
LigandBDBM181033
Substrate/Competitorn/a
Meas. Tech.Biochemical Inhibition Assay
pH7.5±n/a
Temperature298.15±n/a K
IC50 1.20±n/a nM
Commentsextracted
Citation Bair, KWBuckmelter, AJHan, BLin, JReynolds, DJSmith, CCWang, ZZheng, X Compounds and compositions for the inhibition of NAMPT US Patent US9676721 Publication Date 6/13/2017
 
Nicotinamide phosphoribosyltransferase
Name:Nicotinamide phosphoribosyltransferase
Type:Enzyme
Mol. Mass.:55524.98
Organism:Homo sapiens (Human)
Description:P43490
Residue:491
BDBM181033
NameBDBM181033
Synonyms:US9676721, 41 2-cyano-1-({4-[(3-methoxy-4-methylbenzene)sulfonyl]phenyl}methyl)-3-(pyridin-4-yl)guanidine
TypeSmall organic molecule
Emp. Form.C22H21N5O3S
Mol. Mass.435.499
SMILESCOc1cc(ccc1C)S(=O)(=O)c1ccc(CNC(Nc2ccncc2)=NC#N)cc1