Reaction Details
TargetNicotinamide phosphoribosyltransferase
LigandBDBM180257
Substrate/Competitorn/a
Meas. Tech.Biochemical Inhibition Assay
pH7.5±n/a
Temperature298.15±n/a K
IC50 1.70±n/a nM
Commentsextracted
Citation Bair, KWBuckmelter, AJHan, BLin, JReynolds, DJSmith, CCWang, ZZheng, X Compounds and compositions for the inhibition of NAMPT US Patent US9676721 Publication Date 6/13/2017
 
Nicotinamide phosphoribosyltransferase
Name:Nicotinamide phosphoribosyltransferase
Type:Enzyme
Mol. Mass.:55524.98
Organism:Homo sapiens (Human)
Description:P43490
Residue:491
BDBM180257
NameBDBM180257
Synonyms:US9676721, 78 2-cyano-1-{[4-({3-[(morpholin-4-yl)carbonyl]benzene}sulfonyl)phenyl]methyl}-3-(pyridin-4-yl)guanidine
TypeSmall organic molecule
Emp. Form.C25H24N6O4S
Mol. Mass.504.561
SMILESO=C(N1CCOCC1)c1cccc(c1)S(=O)(=O)c1ccc(CNC(Nc2ccncc2)=NC#N)cc1